{"text_format":"1","workbook":"xlsx","n_sheets":8,"sheets":["Intro and Data Inputs","GASB Results","Additional Disclosures","Certification Letter","Inactive","Log","Lookups","Trends"],"not_rendered":{"charts":0,"images":2,"macros":1,"external_links":0,"defined_names":30,"comments":4,"pivot_tables":0},"unopened":[],"bounds":{"document_bytes":16777216,"sheet_cells":100000,"rows_first":2000,"rows_last":500,"rows_between":2000,"halvings":0,"cell_chars":16384,"cell_head_chars":4096},"cells_cut":0,"cells_raw":0,"read":"whole","date_system":"1900"}

{"sheet":"Intro and Data Inputs","index":0,"n_rows":43,"n_cols":9,"rows_kept":43,"cut":false,"hidden":false,"merged":[[3,2,3,7],[31,2,31,7],[32,2,32,7],[30,2,30,7],[0,1,0,8],[2,1,2,8],[21,2,21,6],[22,2,22,6],[7,2,7,7],[8,2,8,7],[9,2,9,7],[12,2,12,7],[4,2,4,7],[5,2,5,7],[10,2,10,7],[1,2,1,7],[6,2,6,7],[11,2,11,7],[43,1,43,8],[13,2,13,7],[14,2,14,7],[15,2,15,7],[16,2,16,7],[17,2,17,7],[26,2,26,3],[27,2,27,3],[29,2,29,6],[28,2,28,6],[33,2,33,7],[18,2,18,7],[19,2,20,7]]}
[null,"GASB 75 Alternative Measurement Method for LEOFF 1"]
[]
[null,"Welcome to the Office of the State Actuary's (OSA) LEOFF 1 AMM Online Tool for FY 2023"]
[null,null,"Intended Use"]
[null,null,"This Alternative Measurement Method (AMM) Online Tool is intended to assist local government employers in Washington State with their Governmental Accounting Standards Board (GASB) Statement No. 75 reporting requirements for Other Postemployment Benefits (OPEB) healthcare obligations provided by local employers to members of the Law Enforcement Officers' and Fire Fighters' Retirement System (LEOFF) Plan 1. Please review the following explanation and directions below, along with the Additional Disclosures and Certification Letter, before proceeding."]
[]
[null,null,"Requirements to use this Tool"]
[null,null,"(1) Employers must be local government entities in Washington State. Employers outside the State of \n      Washington are not eligible to use this Tool."]
[null,null,"(2) Covered members must be active in or retired from LEOFF 1.  \n     Please see the Public Employees Benefits Board (PEBB) AMM Online Tool for reporting PEBB\n     healthcare obligations."]
[null,null,"(3) Employers must have less than 100 total LEOFF 1 members."]
{"$rows_left_out":34}
{"sheet":"GASB Results","index":1,"n_rows":59,"n_cols":8,"rows_kept":59,"cut":false,"hidden":false,"merged":[[26,2,26,4],[26,5,26,6],[28,2,28,4],[50,4,50,5],[55,2,55,5],[39,4,39,5],[29,2,29,6],[34,4,34,5],[35,4,35,5],[36,4,36,5],[37,4,37,5],[38,4,38,5],[48,4,48,5],[33,2,33,6],[19,2,19,4],[13,2,13,3],[18,2,18,4],[24,5,24,6],[25,5,25,6],[14,2,14,3],[13,5,15,6],[16,5,17,6],[10,5,12,6],[16,2,16,3],[17,2,17,3],[11,2,11,3],[4,5,4,6],[5,5,6,6],[6,2,6,3],[7,2,7,3],[8,2,8,3],[9,2,9,3],[10,2,10,3],[7,5,9,6],[0,1,0,7],[2,2,2,4],[3,2,3,4],[4,2,4,3],[5,2,5,3],[1,2,1,4],[1,5,1,6],[2,5,2,6],[3,5,3,6],[60,1,60,7],[59,1,59,7],[45,4,45,5],[40,4,40,5],[41,4,41,5],[42,4,42,5],[43,4,43,5],[44,4,44,5],[46,4,46,5],[47,4,47,5],[53,4,53,5],[52,4,52,5],[51,4,51,5],[49,4,49,5],[54,2,54,5],[56,2,56,5]]}
["     ","LEOFF 1 - GASB 75 Reporting Results and Required Disclosures"]
[]
[null,null,"Schedule of Changes in Total OPEB Liability and Related Ratios"]
[null,null,{"$f":"\"Measurement Date of June 30, \"&Lookups!L17","v":"Measurement Date of June 30, 2023"}]
[null,null,"Total OPEB Liability (TOL)",null,null,"What's New in this FY23 Tool?"]
[null,null,"Service Cost1",null,{"$f":"IF('Intro and Data Inputs'!E28>0, ROUND(Log!L5,0) * 'Intro and Data Inputs'!E28/Log!L6, ROUND(Log!L5,0))","v":0},"And how do these changes impact \nmy resulting OPEB liabilities? ↑or↓"]
[null,null,"Interest Cost",null,{"$f":"ROUND(((E6+E14)*Lookups!L1+E10*((1+Lookups!L1)^0.5-1)),0)","v":0}]
[null,null,"Changes in Experience Data and Assumptions",null,{"$f":"E12-E6-E7-E10","v":0},"- Updated medical cost and premium \n   assumptions consistent with our \n   2022 LEOFF 1 OPEB Report  ↑"]
[null,null,"Changes in Benefit Terms",null,0]
[null,null,"Estimated Benefit Payments",null,{"$f":"IF('Intro and Data Inputs'!E28>0,-ROUND(SUM(Log!G7:J7)/AVERAGE(Trends!D4:H4) * 'Intro and Data Inputs'!E28/Log!L6,0), -ROUND(SUM(Log!G7:J7)/AVERAGE(Trends!D4:H4),0))","v":0}]
{"$rows_left_out":50}
{"sheet":"Additional Disclosures","index":2,"n_rows":40,"n_cols":4,"rows_kept":40,"cut":false,"hidden":false,"merged":[[40,1,40,3],[0,1,0,3]]}
[null,"LEOFF 1 - AMM Online Tool Additional Disclosures"]
[]
[null,null,"This tab is intended to:"]
[null,null,"(1) Provide guidance on concepts that require users to apply their judgment and/or consult with their auditor."]
[null,null,"(2) Document the assumptions and methods we employed for purposes of this AMM Online Tool that vary\n     from the underlying actuarial valuation we performed at the plan-level."]
[]
[null,null,"Data Inputs:"]
[]
[null,null,{"$f":"\"We assume the inputs you provide are as of the measurement date of 6/30/\"&ToolYear&\". If you are not able to determine the counts and average ages as of that time, utilizing your current data or as of your reporting date may be reasonable. \nPlease consult with your auditor for further guidance.\"","v":"We assume the inputs you provide are as of the measurement date of 6/30/2023. If you are not able to determine the counts and average ages as of that time, utilizing your current data or as of your reporting date may be reasonable. \nPlease consult with your auditor for further guidance."}]
[]
{"$rows_left_out":31}
{"sheet":"Certification Letter","index":3,"n_rows":119,"n_cols":4,"rows_kept":119,"cut":false,"hidden":false,"merged":[[0,1,0,3],[59,1,59,3],[60,1,60,3],[119,1,119,3]]}
["`","LEOFF 1 - GASB 75 AMM Online Tool Actuarial Certification"]
[]
[]
[]
[]
[]
[]
[]
[]
[]
{"$rows_left_out":110}
{"sheet":"Inactive","index":4,"n_rows":101,"n_cols":43,"rows_kept":101,"cut":false,"hidden":true,"merged":[[0,19,0,21],[0,9,0,10],[0,11,0,12],[0,13,0,14],[0,16,0,18]]}
["Inactives",0,null,"Medical","Medicare",null,"LTC - Inst.","LTC - Non Inst.",null,"Medical - Age<65",null,"Medical - Age>=65",null,"Medicare ",null,null,"LTC - Inst.",null,null,"LTC - Non Inst.",null,null,null,"Medical","Medicare",null,null,"LTC - Inst.","LTC - Non Inst.",null,null,null,null,null,"Pct Male",1,null,null,null,null,null,"PV of "]
["Year",null,null,"Cost","Cost",null,"Cost","Cost",null,"Trend","Rel Trend","Trend","Rel Trend","Trend","Rel Trend",null,"Rate","Trend","Rel Trend","Rate","Trend","Rel Trend",null,"Net Cost","Net Cost","Total",null,"Net Cost","Net Cost","Total",null,"Grand Total",null,"Mort - M","Mort - F","Mortality","Survive","Interest","Pay Timing",null,null,"Benefits"]
[{"$f":"ToolYear","v":2023},92,null,{"$f":"VLOOKUP(B3,Lookups!A:B,2)","v":16642.142639999998},{"$f":"VLOOKUP(B3,Lookups!A:C,3)","v":2050.1999999999998},null,{"$f":"VLOOKUP(B3,Lookups!A:D,4)","v":189294.77250000002},{"$f":"VLOOKUP(B3,Lookups!A:E,5)","v":173032.16590357147},null,{"$f":"VLOOKUP(A3,Trends!$A$3:$H$94,IF(ExFlg=0,4,2))+Sens","v":1.0640000000000001},1,{"$f":"VLOOKUP(A3,Trends!$A$3:$H$94,IF(ExFlg=0,5,3))+Sens","v":1.0640000000000001},1,{"$f":"VLOOKUP(A3,Trends!$A$3:$H$94,6)+Sens","v":1.075},1,null,{"$f":"IF(B3<=120,VLOOKUP(B3,Lookups!$A$3:$I$103,8,FALSE),\"\")","v":0.10818571428571429},{"$f":"VLOOKUP(A3,Trends!$A$3:$H$94,7)+Sens","v":1.0475000000000001},1,{"$f":"IF(B3<=120,VLOOKUP(B3,Lookups!$A$3:$I$103,9,FALSE),\"\")","v":8.3799999999999999E-2},{"$f":"VLOOKUP(A3,Trends!$A$3:$H$94,8)+Sens","v":1.0475000000000001},1,null,{"$f":"IF(B3<=120,IF(B3<65,D3*K3,D3*M3),\"\")","v":16642.142639999998},{"$f":"IF(B3<=120,E3*O3,\"\")","v":2050.1999999999998},{"$f":"IF(B3<=120,X3+Y3,\"\")","v":18692.342639999999},null,{"$f":"IF(B3<=120,G3*Q3*S3,\"\")","v":20478.990173464288},{"$f":"IF(B3<=120,H3*T3*V3,\"\")","v":14500.095502719289},{"$f":"IF(B3<=120,AB3+AC3,\"\")","v":34979.085676183575},null,{"$f":"IF(B3<=120,Z3+AD3, \"\")","v":53671.428316183577},null,{"$f":"IF($B3<121,VLOOKUP($B3,Lookups!A:F,6)*(1-VLOOKUP($B3,Lookups!$N$3:$P$103,2))^($A3-$A$3),\"\")","v":0.17136341030805227},{"$f":"IF($B3<121,VLOOKUP($B3,Lookups!A:G,7)*(1-VLOOKUP($B3,Lookups!$N$3:$P$103,3))^($A3-$A$3),\"\")","v":0.13152665207082354},{"$f":"IF(B3<121,(PCTMALE*AH3+(1-PCTMALE)*AI3),\"\")","v":0.17136341030805227},1,1,{"$f":"IF(AJ3=\"\",\"\",ROUND((13/24)+(11/24)*(1/(1+IntRt))*(1-AJ3),6))","v":0.90847299999999997},null,null,{"$f":"IF(B3<=120,AF3*AK3*AL3*AM3,\"\")","v":48759.043496688239}]
[{"$f":"1+A3","v":2024},{"$f":"1+B3","v":93},null,{"$f":"VLOOKUP(B4,Lookups!A:B,2)","v":16642.142639999998},{"$f":"VLOOKUP(B4,Lookups!A:C,3)","v":2050.1999999999998},null,{"$f":"VLOOKUP(B4,Lookups!A:D,4)","v":183779.68500000003},{"$f":"VLOOKUP(B4,Lookups!A:E,5)","v":169652.34879285717},null,{"$f":"VLOOKUP(A4,Trends!$A$3:$H$94,IF(ExFlg=0,4,2))+Sens","v":1.0649999999999999},{"$f":"K3*J3","v":1.0640000000000001},{"$f":"VLOOKUP(A4,Trends!$A$3:$H$94,IF(ExFlg=0,5,3))+Sens","v":1.0649999999999999},{"$f":"M3*L3","v":1.0640000000000001},{"$f":"VLOOKUP(A4,Trends!$A$3:$H$94,6)+Sens","v":1.0840000000000001},{"$f":"O3*N3","v":1.075},null,{"$f":"IF(B4<=120,VLOOKUP(B4,Lookups!$A$3:$I$103,8,FALSE),\"\")","v":0.11662857142857144},{"$f":"VLOOKUP(A4,Trends!$A$3:$H$94,7)+Sens","v":1.0475000000000001},{"$f":"S3*R3","v":1.0475000000000001},{"$f":"IF(B4<=120,VLOOKUP(B4,Lookups!$A$3:$I$103,9,FALSE),\"\")","v":8.6499999999999994E-2},{"$f":"VLOOKUP(A4,Trends!$A$3:$H$94,8)+Sens","v":1.0475000000000001},{"$f":"V3*U3","v":1.0475000000000001},null,{"$f":"IF(B4<=120,IF(B4<65,D4*K4,D4*M4),\"\")","v":17707.23976896},{"$f":"IF(B4<=120,E4*O4,\"\")","v":2203.9649999999997},{"$f":"IF(B4<=120,X4+Y4,\"\")","v":19911.20476896},null,{"$f":"IF(B4<=120,G4*Q4*S4,\"\")","v":22452.075319802152},{"$f":"IF(B4<=120,H4*T4*V4,\"\")","v":15371.987258684798},{"$f":"IF(B4<=120,AB4+AC4,\"\")","v":37824.062578486948},null,{"$f":"IF(B4<=120,Z4+AD4, \"\")","v":57735.267347446948},null,{"$f":"IF($B4<121,VLOOKUP($B4,Lookups!A:F,6)*(1-VLOOKUP($B4,Lookups!$N$3:$P$103,2))^($A4-$A$3),\"\")","v":0.18420510993218206},{"$f":"IF($B4<121,VLOOKUP($B4,Lookups!A:G,7)*(1-VLOOKUP($B4,Lookups!$N$3:$P$103,3))^($A4-$A$3),\"\")","v":0.14328094978199732},{"$f":"IF(B4<121,(PCTMALE*AH4+(1-PCTMALE)*AI4),\"\")","v":0.18420510993218206},{"$f":"IF(B4<121,AK3*(1-AJ3),\"\")","v":0.82863658969194776},{"$f":"IF(B4<121,AL3/(1+IntRt),\"\")","v":0.96581031485416258},{"$f":"IF(AJ4=\"\",\"\",ROUND((13/24)+(11/24)*(1/(1+IntRt))*(1-AJ4),6))","v":0.90278899999999995},null,null,{"$f":"IF(B4<=120,AF4*AK4*AL4*AM4,\"\")","v":41714.148766440994}]
[2025,94,null,{"$f":"VLOOKUP(B5,Lookups!A:B,2)","v":16642.142639999998},{"$f":"VLOOKUP(B5,Lookups!A:C,3)","v":2050.1999999999998},null,{"$f":"VLOOKUP(B5,Lookups!A:D,4)","v":178264.5975},{"$f":"VLOOKUP(B5,Lookups!A:E,5)","v":166272.53168214287},null,{"$f":"VLOOKUP(A5,Trends!$A$3:$H$94,IF(ExFlg=0,4,2))+Sens","v":1.06},{"$f":"K4*J4","v":1.1331599999999999},{"$f":"VLOOKUP(A5,Trends!$A$3:$H$94,IF(ExFlg=0,5,3))+Sens","v":1.06},{"$f":"M4*L4","v":1.1331599999999999},{"$f":"VLOOKUP(A5,Trends!$A$3:$H$94,6)+Sens","v":1.0860000000000001},{"$f":"O4*N4","v":1.1653},null,{"$f":"IF(B5<=120,VLOOKUP(B5,Lookups!$A$3:$I$103,8,FALSE),\"\")","v":0.12507142857142858},{"$f":"VLOOKUP(A5,Trends!$A$3:$H$94,7)+Sens","v":1.0475000000000001},{"$f":"S4*R4","v":1.0972562500000003},{"$f":"IF(B5<=120,VLOOKUP(B5,Lookups!$A$3:$I$103,9,FALSE),\"\")","v":8.9200000000000002E-2},{"$f":"VLOOKUP(A5,Trends!$A$3:$H$94,8)+Sens","v":1.0475000000000001},{"$f":"V4*U4","v":1.0972562500000003},null,18858.210353942399,2389.0980599999998,21247.308413942399,null,24464.214537487653,16273.966853566646,40738.181391054299,null,61985.489804996701,null,{"$f":"IF($B5<121,VLOOKUP($B5,Lookups!A:F,6)*(1-VLOOKUP($B5,Lookups!$N$3:$P$103,2))^($A5-$A$3),\"\")","v":0.19655300525964114},{"$f":"IF($B5<121,VLOOKUP($B5,Lookups!A:G,7)*(1-VLOOKUP($B5,Lookups!$N$3:$P$103,3))^($A5-$A$3),\"\")","v":0.15548897035590095},0.19655300525964114,{"$f":"IF(B5<121,AK4*(1-AJ4),\"\")","v":0.67599749559391409},0.93278956427869664,0.89732299999999998,null,null,35072.570966703082]
[2026,95,null,{"$f":"VLOOKUP(B6,Lookups!A:B,2)","v":16642.142639999998},{"$f":"VLOOKUP(B6,Lookups!A:C,3)","v":2050.1999999999998},null,{"$f":"VLOOKUP(B6,Lookups!A:D,4)","v":172749.51},{"$f":"VLOOKUP(B6,Lookups!A:E,5)","v":162892.71457142857},null,{"$f":"VLOOKUP(A6,Trends!$A$3:$H$94,IF(ExFlg=0,4,2))+Sens","v":1.054},{"$f":"K5*J5","v":1.2011495999999999},{"$f":"VLOOKUP(A6,Trends!$A$3:$H$94,IF(ExFlg=0,5,3))+Sens","v":1.054},1.2011495999999999,{"$f":"VLOOKUP(A6,Trends!$A$3:$H$94,6)+Sens","v":1.071},1.2655158000000002,null,{"$f":"IF(B6<=120,VLOOKUP(B6,Lookups!$A$3:$I$103,8,FALSE),\"\")","v":0.13351428571428572},{"$f":"VLOOKUP(A6,Trends!$A$3:$H$94,7)+Sens","v":1.0475000000000001},{"$f":"S5*R5","v":1.1493759218750004},{"$f":"IF(B6<=120,VLOOKUP(B6,Lookups!$A$3:$I$103,9,FALSE),\"\")","v":9.1899999999999996E-2},{"$f":"VLOOKUP(A6,Trends!$A$3:$H$94,8)+Sens","v":1.0475000000000001},1.1493759218750004,null,19989.702975178941,2594.5604931600001,22584.263468338941,null,26509.812483378562,17205.974189509921,43715.786672888484,null,66300.050141227432,null,{"$f":"IF($B6<121,VLOOKUP($B6,Lookups!A:F,6)*(1-VLOOKUP($B6,Lookups!$N$3:$P$103,2))^($A6-$A$3),\"\")","v":0.20909879530501169},{"$f":"IF($B6<121,VLOOKUP($B6,Lookups!A:G,7)*(1-VLOOKUP($B6,Lookups!$N$3:$P$103,3))^($A6-$A$3),\"\")","v":0.1692984926942851},0.20909879530501169,0.54312815628693922,0.90089778276868515,0.89176900000000003,null,null,28929.708903183189]
[2027,96,null,{"$f":"VLOOKUP(B7,Lookups!A:B,2)","v":16642.142639999998},{"$f":"VLOOKUP(B7,Lookups!A:C,3)","v":2050.1999999999998},null,{"$f":"VLOOKUP(B7,Lookups!A:D,4)","v":167234.42250000002},{"$f":"VLOOKUP(B7,Lookups!A:E,5)","v":159512.89746071427},null,{"$f":"VLOOKUP(A7,Trends!$A$3:$H$94,IF(ExFlg=0,4,2))+Sens","v":1.05},1.2660116784,{"$f":"VLOOKUP(A7,Trends!$A$3:$H$94,IF(ExFlg=0,5,3))+Sens","v":1.05},1.2660116784,{"$f":"VLOOKUP(A7,Trends!$A$3:$H$94,6)+Sens","v":1.06},{"$f":"O6*N6","v":1.3553674218000002},null,{"$f":"IF(B7<=120,VLOOKUP(B7,Lookups!$A$3:$I$103,8,FALSE),\"\")","v":0.14195714285714287},{"$f":"VLOOKUP(A7,Trends!$A$3:$H$94,7)+Sens","v":1.0475000000000001},1.203971278164063,{"$f":"IF(B7<=120,VLOOKUP(B7,Lookups!$A$3:$I$103,9,FALSE),\"\")","v":9.459999999999999E-2},{"$f":"VLOOKUP(A7,Trends!$A$3:$H$94,8)+Sens","v":1.0475000000000001},1.203971278164063,null,21069.146935838606,2778.7742881743602,23847.921224012967,null,28582.423589924103,18167.830389930008,46750.253979854111,null,70598.175203867082,null,{"$f":"IF($B7<121,VLOOKUP($B7,Lookups!A:F,6)*(1-VLOOKUP($B7,Lookups!$N$3:$P$103,2))^($A7-$A$3),\"\")","v":0.22256430375811906},{"$f":"IF($B7<121,VLOOKUP($B7,Lookups!A:G,7)*(1-VLOOKUP($B7,Lookups!$N$3:$P$103,3))^($A7-$A$3),\"\")","v":0.18522568335380174},0.22256430375811906,0.42956071311110816,0.87009637122724071,0.88580899999999996,null,null,23373.592936133602]
[2028,97,null,{"$f":"VLOOKUP(B8,Lookups!A:B,2)","v":16642.142639999998},{"$f":"VLOOKUP(B8,Lookups!A:C,3)","v":2050.1999999999998},null,{"$f":"VLOOKUP(B8,Lookups!A:D,4)","v":161719.33500000002},{"$f":"VLOOKUP(B8,Lookups!A:E,5)","v":156133.08035},null,{"$f":"VLOOKUP(A8,Trends!$A$3:$H$94,IF(ExFlg=0,4,2))+Sens","v":1.048},1.32931226232,{"$f":"VLOOKUP(A8,Trends!$A$3:$H$94,IF(ExFlg=0,5,3))+Sens","v":1.048},1.32931226232,{"$f":"VLOOKUP(A8,Trends!$A$3:$H$94,6)+Sens","v":1.056},1.4366894671080004,null,{"$f":"IF(B8<=120,VLOOKUP(B8,Lookups!$A$3:$I$103,8,FALSE),\"\")","v":0.15040000000000001},{"$f":"VLOOKUP(A8,Trends!$A$3:$H$94,7)+Sens","v":1.0475000000000001},1.2611599138768561,{"$f":"IF(B8<=120,VLOOKUP(B8,Lookups!$A$3:$I$103,9,FALSE),\"\")","v":9.7299999999999998E-2},{"$f":"VLOOKUP(A8,Trends!$A$3:$H$94,8)+Sens","v":1.0475000000000001},1.2611599138768561,null,22122.604282630535,2945.5007454648221,25068.105028095357,null,30674.6729671637,19159.224504901082,49833.897472064782,null,74902.002500160132,null,{"$f":"IF($B8<121,VLOOKUP($B8,Lookups!A:F,6)*(1-VLOOKUP($B8,Lookups!$N$3:$P$103,2))^($A8-$A$3),\"\")","v":0.23663059312110837},{"$f":"IF($B8<121,VLOOKUP($B8,Lookups!A:G,7)*(1-VLOOKUP($B8,Lookups!$N$3:$P$103,3))^($A8-$A$3),\"\")","v":0.2020567973914206},0.23663059312110837,0.33395583207569324,0.84034805024844561,0.87958199999999997,null,null,18489.194493038078]
[2029,98,null,{"$f":"VLOOKUP(B9,Lookups!A:B,2)","v":16642.142639999998},{"$f":"VLOOKUP(B9,Lookups!A:C,3)","v":2050.1999999999998},null,{"$f":"VLOOKUP(B9,Lookups!A:D,4)","v":161719.33500000002},{"$f":"VLOOKUP(B9,Lookups!A:E,5)","v":156133.08035},null,{"$f":"VLOOKUP(A9,Trends!$A$3:$H$94,IF(ExFlg=0,4,2))+Sens","v":1.046},1.3931192509113601,{"$f":"VLOOKUP(A9,Trends!$A$3:$H$94,IF(ExFlg=0,5,3))+Sens","v":1.046},1.3931192509113601,{"$f":"VLOOKUP(A9,Trends!$A$3:$H$94,6)+Sens","v":1.0569999999999999},1.5171440772660485,null,{"$f":"IF(B9<=120,VLOOKUP(B9,Lookups!$A$3:$I$103,8,FALSE),\"\")","v":0.15040000000000001},{"$f":"VLOOKUP(A9,Trends!$A$3:$H$94,7)+Sens","v":1.0475000000000001},1.3210650097860068,{"$f":"IF(B9<=120,VLOOKUP(B9,Lookups!$A$3:$I$103,9,FALSE),\"\")","v":9.7299999999999998E-2},{"$f":"VLOOKUP(A9,Trends!$A$3:$H$94,8)+Sens","v":1.0475000000000001},1.3210650097860068,null,23184.489288196804,3110.4487872108525,26294.938075407656,null,32131.719933103977,20069.287668883884,52201.007601987862,null,78495.945677395517,null,{"$f":"IF($B9<121,VLOOKUP($B9,Lookups!A:F,6)*(1-VLOOKUP($B9,Lookups!$N$3:$P$103,2))^($A9-$A$3),\"\")","v":0.25203406672933154},{"$f":"IF($B9<121,VLOOKUP($B9,Lookups!A:G,7)*(1-VLOOKUP($B9,Lookups!$N$3:$P$103,3))^($A9-$A$3),\"\")","v":0.22008577949844529},0.25203406672933154,0.25493166545536866,0.81161681499753291,0.87276399999999998,null,null,14174.862974985095]
[2030,99,null,{"$f":"VLOOKUP(B10,Lookups!A:B,2)","v":16642.142639999998},{"$f":"VLOOKUP(B10,Lookups!A:C,3)","v":2050.1999999999998},null,{"$f":"VLOOKUP(B10,Lookups!A:D,4)","v":161719.33500000002},{"$f":"VLOOKUP(B10,Lookups!A:E,5)","v":156133.08035},null,{"$f":"VLOOKUP(A10,Trends!$A$3:$H$94,IF(ExFlg=0,4,2))+Sens","v":1.044},1.4572027364532827,{"$f":"VLOOKUP(A10,Trends!$A$3:$H$94,IF(ExFlg=0,5,3))+Sens","v":1.044},1.4572027364532827,{"$f":"VLOOKUP(A10,Trends!$A$3:$H$94,6)+Sens","v":1.0589999999999999},1.6036212896702131,null,{"$f":"IF(B10<=120,VLOOKUP(B10,Lookups!$A$3:$I$103,8,FALSE),\"\")","v":0.15040000000000001},{"$f":"VLOOKUP(A10,Trends!$A$3:$H$94,7)+Sens","v":1.0475000000000001},1.3838155977508422,{"$f":"IF(B10<=120,VLOOKUP(B10,Lookups!$A$3:$I$103,9,FALSE),\"\")","v":9.7299999999999998E-2},{"$f":"VLOOKUP(A10,Trends!$A$3:$H$94,8)+Sens","v":1.0475000000000001},1.3838155977508422,null,24250.975795453855,3287.7443680818706,27538.720163535727,null,33657.976629926416,21022.578833155869,54680.555463082288,null,82219.275626618008,null,{"$f":"IF($B10<121,VLOOKUP($B10,Lookups!A:F,6)*(1-VLOOKUP($B10,Lookups!$N$3:$P$103,2))^($A10-$A$3),\"\")","v":0.26802582056023538},{"$f":"IF($B10<121,VLOOKUP($B10,Lookups!A:G,7)*(1-VLOOKUP($B10,Lookups!$N$3:$P$103,3))^($A10-$A$3),\"\")","v":0.23839348816979744},0.26802582056023538,0.19068020107257067,0.78386789163369985,0.86568500000000004,null,null,10638.539620427369]
{"$rows_left_out":92}
{"sheet":"Log","index":5,"n_rows":32,"n_cols":12,"rows_kept":32,"cut":false,"hidden":true,"merged":[[0,1,0,4],[0,6,0,9]]}
["EoP = End of Period","Actives Cohort",null,null,null,null,"Inactive Cohorts"]
["BoP = Beginning of Period","1","2","3","4",null,"1","2","3","4"]
[null,null,null,null,null,null,"< 75","75-79","80-85","85+",null,"Total"]
["Run 1 - EoP Data, BoP Discount Rate, New HC Assumptions"]
["Service Cost (EANC)",null,null,null,null,null,null,null,null,null,null,{"$f":"SUM(B5:E5)","v":0}]
["Total OPEB Liability (TOL)",null,null,null,null,null,0,0,0,0,null,{"$f":"SUM(B6:E6,G6:J6)","v":0}]
["Expected Benefit Payments ",null,null,null,null,null,0,0,0,0,null,{"$f":"SUM(B7:E7,G7:J7)","v":0}]
[]
["Run 2 - EoP Data, EoP Discount Rate, New HC Assumptions"]
["Service Cost (EANC)",null,null,null,null,null,null,null,null,null,null,{"$f":"SUM(B10:E10)","v":0}]
{"$rows_left_out":23}
{"sheet":"Lookups","index":6,"n_rows":103,"n_cols":26,"rows_kept":103,"cut":false,"hidden":true,"merged":[[0,7,1,7],[0,8,1,8],[0,14,0,15]]}
[null,"Medical","Medicare ","LTC Inst.","LTC Non-","Mortality","Mortality","Institutional\nLTC Rate","Non-Inst.\nLTC Rate",null,{"$f":"ToolYear - 1 & \" Discount\"","v":"2022 Discount"},3.5400000000000001E-2,null,null,"MP-2017 Ultimate",null,null,"Medical","Medicare ","LTC Inst.","LTC Non-",null,"Mortality","Mortality"]
["Age","Cost","Cost","Cost","Inst. Cost","Male","Female",null,null,null,{"$f":"ToolYear & \" Discount\"","v":"2023 Discount"},3.6499999999999998E-2,null,"Age","Male","Female",null,"Cost","Cost","Cost","Inst. Cost",null,"Male","Female"]
[20,{"$f":"R3*PRODUCT(IF(Trends!$A$3:$A$94<ToolYear,IF(ExFlg=1,Trends!$B$3:$B$94,Trends!$D$3:$D$94),1))","v":0},0,{"$f":"T3*PRODUCT(IF(Trends!$A$3:$A$94<ToolYear,Trends!$G$3:$G$94,1))","v":0},{"$f":"U3*PRODUCT(IF(Trends!$A$3:$A$94<ToolYear,Trends!$H$3:$H$94,1))","v":0},{"$f":"W3*(1-O3)^(ToolYear-MortBaseYear)","v":8.2048215650403476E-4},{"$f":"X3*(1-P3)^(ToolYear-MortBaseYear)","v":3.0274475293464386E-4},0,0,null,null,null,null,20,0.01,0.01,null,0,0,0,0,null,9.3499999999999996E-4,3.4499999999999998E-4,null,"Sources"]
[{"$f":"1+A3","v":21},{"$f":"R4*PRODUCT(IF(Trends!$A$3:$A$94<ToolYear,IF(ExFlg=1,Trends!$B$3:$B$94,Trends!$D$3:$D$94),1))","v":0},0,{"$f":"T4*PRODUCT(IF(Trends!$A$3:$A$94<ToolYear,Trends!$G$3:$G$94,1))","v":0},{"$f":"U4*PRODUCT(IF(Trends!$A$3:$A$94<ToolYear,Trends!$H$3:$H$94,1))","v":0},8.4242018207900907E-4,3.2029517339462321E-4,0,0,null,null,"Int Rt",null,21,0.01,0.01,null,0,0,0,0,null,9.6000000000000002E-4,3.6499999999999998E-4,null,"Mortality Assumption"]
[22,{"$f":"R5*PRODUCT(IF(Trends!$A$3:$A$94<ToolYear,IF(ExFlg=1,Trends!$B$3:$B$94,Trends!$D$3:$D$94),1))","v":0},0,{"$f":"T5*PRODUCT(IF(Trends!$A$3:$A$94<ToolYear,Trends!$G$3:$G$94,1))","v":0},{"$f":"U5*PRODUCT(IF(Trends!$A$3:$A$94<ToolYear,Trends!$H$3:$H$94,1))","v":0},8.4242018207900907E-4,3.3345798873960777E-4,0,0,null,null,3.5400000000000001E-2,null,22,0.01,0.01,null,0,0,0,0,null,9.6000000000000002E-4,3.8000000000000002E-4,null,"Medical, Medicare, and LTC Costs"]
[23,{"$f":"R6*PRODUCT(IF(Trends!$A$3:$A$94<ToolYear,IF(ExFlg=1,Trends!$B$3:$B$94,Trends!$D$3:$D$94),1))","v":0},0,{"$f":"T6*PRODUCT(IF(Trends!$A$3:$A$94<ToolYear,Trends!$G$3:$G$94,1))","v":0},{"$f":"U6*PRODUCT(IF(Trends!$A$3:$A$94<ToolYear,Trends!$H$3:$H$94,1))","v":0},8.3364497184901937E-4,3.4223319896959742E-4,0,0,null,null,null,null,23,0.01,0.01,null,0,0,0,0,null,9.5E-4,3.8999999999999999E-4,null,"LTC Probabilities"]
[24,{"$f":"R7*PRODUCT(IF(Trends!$A$3:$A$94<ToolYear,IF(ExFlg=1,Trends!$B$3:$B$94,Trends!$D$3:$D$94),1))","v":0},0,{"$f":"T7*PRODUCT(IF(Trends!$A$3:$A$94<ToolYear,Trends!$G$3:$G$94,1))","v":0},{"$f":"U7*PRODUCT(IF(Trends!$A$3:$A$94<ToolYear,Trends!$H$3:$H$94,1))","v":0},8.2925736673402446E-4,3.5539601431458192E-4,0,0,null,null,"Sens",null,24,0.01,0.01,null,0,0,0,0,null,9.4499999999999998E-4,4.0499999999999998E-4,null,"Discount Rate"]
[25,{"$f":"R8*PRODUCT(IF(Trends!$A$3:$A$94<ToolYear,IF(ExFlg=1,Trends!$B$3:$B$94,Trends!$D$3:$D$94),1))","v":0},0,{"$f":"T8*PRODUCT(IF(Trends!$A$3:$A$94<ToolYear,Trends!$G$3:$G$94,1))","v":0},{"$f":"U8*PRODUCT(IF(Trends!$A$3:$A$94<ToolYear,Trends!$H$3:$H$94,1))","v":0},8.2925736673402446E-4,3.7294643477456127E-4,0,0,null,null,0,null,25,0.01,0.01,null,0,0,0,0,null,9.4499999999999998E-4,4.2499999999999998E-4,null,"2022 Milliman Letter"]
[26,{"$f":"R9*PRODUCT(IF(Trends!$A$3:$A$94<ToolYear,IF(ExFlg=1,Trends!$B$3:$B$94,Trends!$D$3:$D$94),1))","v":0},0,{"$f":"T9*PRODUCT(IF(Trends!$A$3:$A$94<ToolYear,Trends!$G$3:$G$94,1))","v":0},{"$f":"U9*PRODUCT(IF(Trends!$A$3:$A$94<ToolYear,Trends!$H$3:$H$94,1))","v":0},8.4680778719400387E-4,4.0365967057952518E-4,0,0,null,null,null,null,26,0.01,0.01,null,0,0,0,0,null,9.6500000000000004E-4,4.6000000000000001E-4]
[27,{"$f":"R10*PRODUCT(IF(Trends!$A$3:$A$94<ToolYear,IF(ExFlg=1,Trends!$B$3:$B$94,Trends!$D$3:$D$94),1))","v":0},0,{"$f":"T10*PRODUCT(IF(Trends!$A$3:$A$94<ToolYear,Trends!$G$3:$G$94,1))","v":0},{"$f":"U10*PRODUCT(IF(Trends!$A$3:$A$94<ToolYear,Trends!$H$3:$H$94,1))","v":0},8.6435820765398317E-4,4.2559769615449933E-4,0,0,null,null,"ExFlg",null,27,0.01,0.01,null,0,0,0,0,null,9.8499999999999998E-4,4.8499999999999997E-4]
{"$rows_left_out":94}
{"sheet":"Trends","index":7,"n_rows":94,"n_cols":10,"rows_kept":94,"cut":false,"hidden":true,"merged":[[0,1,0,7]]}
["Beginning of ","Costs Trends"]
["Year","Placeholder","Placeholder","Medical \nNo Excise Tax - Age<65","Medical \n No Excise Tax - Age>=65","Medicare Part B","LTC Inst.","LTC Non-Inst."]
[{"$f":"ValYear","v":2022},{"$f":"D3","v":1.0589999999999999},{"$f":"E3","v":1.0589999999999999},1.0589999999999999,1.0589999999999999,1.02,1.0475000000000001,1.0475000000000001,null,"Trends Source:"]
[{"$f":"1+A3","v":2023},{"$f":"D4","v":1.0640000000000001},{"$f":"E4","v":1.0640000000000001},1.0640000000000001,1.0640000000000001,1.075,1.0475000000000001,1.0475000000000001,null,"Medical, Medicare, and LTC Costs"]
[2024,1.0649999999999999,1.0649999999999999,1.0649999999999999,1.0649999999999999,1.0840000000000001,1.0475000000000001,1.0475000000000001,null,"2022 Milliman Letter"]
[2025,1.06,1.06,1.06,1.06,1.0860000000000001,1.0475000000000001,1.0475000000000001]
[2026,1.054,1.054,1.054,1.054,1.071,1.0475000000000001,1.0475000000000001]
[2027,1.05,1.05,1.05,1.05,1.06,1.0475000000000001,1.0475000000000001]
[2028,1.048,1.048,1.048,1.048,1.056,1.0475000000000001,1.0475000000000001]
[2029,1.046,1.046,1.046,1.046,1.0569999999999999,1.0475000000000001,1.0475000000000001]
{"$rows_left_out":84}